3-mercaptoheptanol

Van Den Dool and Kratz RI, non-polar column, temperature ramp

View large format table.

Column type Active phase I Reference Comment
CapillaryBPX-51286.Sarrazin E., Shinkaruk S., et al., 200750. m/0.25 mm/1. μm, 45. C @ 10. min, 3. K/min, 250. C @ 20. min

Van Den Dool and Kratz RI, polar column, temperature ramp

View large format table.

Column type Active phase I Reference Comment
CapillaryBP-201956.Sarrazin E., Shinkaruk S., et al., 200750. m/0.22 mm/0.25 μm, 45. C @ 10. min, 3. K/min, 230. C @ 20. min

Normal alkane RI, non-polar column, custom temperature program

View large format table.

Column type Active phase I Reference Comment
CapillaryCP Sil 5 CB1198.Vermeulen, Guyot-Declerck, et al., 200350. m/0.32 mm/1.2 μm, He; Program: 40C(4min) => 2C/min => 132C => 10C/min => 250C(45min)

Normal alkane RI, polar column, custom temperature program

View large format table.

Column type Active phase I Reference Comment
CapillaryFFAP1962.Vermeulen, Guyot-Declerck, et al., 200325. m/0.32 mm/0.3 μm; Program: 40C(4min) => 2C/min => 132C => 10C/min => 250C(15min)

References

Sarrazin E., Shinkaruk S., et al., 2007
Sarrazin E.; Shinkaruk S.; Bennetau B.; Frerot E.; Dubourdieu D., Odorous impact of volatile thiols on the aroma of young botrytized sweet wines: Identification and quantification of new sulfanyl alcohols, J. Agric. Food Chem., 2007, 55, 4, 1437-1444, https://doi.org/10.1021/jf062582v . [all data]

Vermeulen, Guyot-Declerck, et al., 2003
Vermeulen, C.; Guyot-Declerck, C.; Collin, S., Combinatorial synthesis and sensorial properties of mercapto primary alcohols and analogues, J. Agric. Food Chem., 2003, 51, 12, 3623-3628, https://doi.org/10.1021/jf0212340 . [all data]