Dehydroxylinalooloxide A
- Formula: C10H18O
- Molecular weight: 154.2493
- IUPAC Standard InChIKey: NETOHYFTCONTDT-SNVBAGLBSA-N
- Chemical structure:
View 3d structure (requires JavaScript / HTML 5) - Stereoisomers:

Normal alkane RI, non-polar column, temperature ramp

Column type | Active phase | I | Reference | Comment |
---|---|---|---|---|
Capillary | ZB-1 | 977. | Mierendorff, Stahl-Biskup, et al., 2008 | 30. m/0.25 mm/0.25 μm, Nitrogen, 3. K/min; Tstart: 45. C; Tend: 230. C |
Capillary | ZB-1 | 977. | Mierendorff, Stahl-Biskup, et al., 2003 | 30. m/0.25 mm/0.25 μm, N2, 3. K/min; Tstart: 45. C; Tend: 230. C |

References

Mierendorff, Stahl-Biskup, et al., 2008
Mierendorff, H.-G.; Stahl-Biskup, E.; Posthumus, M.A.; van Beek, T.A.,
Composition of commercial Cape chamomile oil (Eriocephalus punctuatus / Eriocephalus tenuifolius), 2008, retrieved from http://www.chemische-analysen-hamburg.de/Publikationen?CapeChamomileOil/. [all data]
Mierendorff, Stahl-Biskup, et al., 2003
Mierendorff, H.-G.; Stahl-Biskup, E.; Posthumus, M.A.; van Beek, T.A.,
Composition of commercial Cape chamomile oil (Eriocephalus punctulatus),
Flavour Fragr. J., 2003, 18, 6, 510-514, https://doi.org/10.1002/ffj.1259
. [all data]