cis-Cubenol
- Formula: C15H26O
- Molecular weight: 222.3663
- IUPAC Standard InChIKey: COGPRPSWSKLKTF-KBUPBQIOSA-N
- Chemical structure:
View 3d structure (requires JavaScript / HTML 5) - Stereoisomers:

Normal alkane RI, non-polar column, temperature ramp

Column type | Active phase | I | Reference | Comment |
---|---|---|---|---|
Capillary | HP-5 | 1668. | Chaves, Lago, et al., 2003 | 30. m/0.32 mm/0.25 μm, He, 100. C @ 2. min, 5. K/min, 240. C @ 5. min |
Capillary | HP-5 | 1616. | Lago, Reis, et al., 2002 | 30. m/0.32 mm/0.25 μm, 100. C @ 2. min, 5. K/min, 240. C @ 5. min |

References

Chaves, Lago, et al., 2003
Chaves, M.H.; Lago, J.H.G.; Roque, N.F.,
Macrocarpane, a new sesquiterpene skeleton from the leaves of Porcelia macrocarpa,
J. Braz. Chem. Soc., 2003, 14, 1, 16-19, retrieved from http://jbcs.sbq.org.br/jbcs/2003/v14n1/03.pdf, https://doi.org/10.1590/S0103-50532003000100004
. [all data]
Lago, Reis, et al., 2002
Lago, J.H.G.; Reis, A.A.; Roque, N.F.,
Chemical composition from volatile oil of the stem bark of Guarea macrophylla Vahl. ssp. tuberculata Vellozo (Meliaceae),
Flavour Fragr. J., 2002, 17, 4, 255-257, https://doi.org/10.1002/ffj.1091
. [all data]