Butanoic acid, 1,2-dimethylpropyl ester

Kovats' RI, non-polar column, isothermal

View large format table.

Column type Active phase Temperature (C) I Reference Comment
CapillarySE-30100.985.Haken, Madden, et al., 1985N2; Column length: 25. m; Column diameter: 0.33 mm
CapillarySE-30120.978.Haken, Madden, et al., 1985N2; Column length: 25. m; Column diameter: 0.33 mm
CapillarySE-30140.1000.Haken, Madden, et al., 1985N2; Column length: 25. m; Column diameter: 0.33 mm
CapillarySE-3060.1000.Haken, Madden, et al., 1985N2; Column length: 25. m; Column diameter: 0.33 mm
CapillarySE-3080.993.Haken, Madden, et al., 1985N2; Column length: 25. m; Column diameter: 0.33 mm
PackedSE-30100.994.Zarazir, Chovin, et al., 1970Chromosorb W; Column length: 2. m

Kovats' RI, polar column, isothermal

View large format table.

Column type Active phase Temperature (C) I Reference Comment
CapillaryOV-351100.1209.Haken, Madden, et al., 1985N2; Column length: 25. m; Column diameter: 0.32 mm
CapillaryOV-351120.1243.Haken, Madden, et al., 1985N2; Column length: 25. m; Column diameter: 0.32 mm
CapillaryOV-35160.1200.Haken, Madden, et al., 1985N2; Column length: 25. m; Column diameter: 0.32 mm
CapillaryOV-35180.1193.Haken, Madden, et al., 1985N2; Column length: 25. m; Column diameter: 0.32 mm
PackedCarbowax 20M100.1210.Zarazir, Chovin, et al., 1970Chromosorb W; Column length: 2. m

References

Haken, Madden, et al., 1985
Haken, J.K.; Madden, B.G.; Korhonen, I.O.O., Gas chromatography of homologous esters. XXXI. Butanoyl and monochlorobutanoyl esters of lower saturated branched chain and unsaturated alcohols on SE-30 and OV-351 capillary columns, J. Chromatogr., 1985, 325, 61-73, https://doi.org/10.1016/S0021-9673(00)96008-4 . [all data]

Zarazir, Chovin, et al., 1970
Zarazir, D.; Chovin, P.; Guiochon, G., Identification of hydroxylic compounds and their derivatives by gas chromatography, Chromatographia, 1970, 3, 4, 180-195, https://doi.org/10.1007/BF02269018 . [all data]