(E,Z,Z)-1,5,9-Cyclododecatriene, 3-methyl
- Formula: C12H18
- Molecular weight: 162.2713
- IUPAC Standard InChIKey: NONATMBHGBQNTN-DZNNNWEBSA-N
- Chemical structure:
View 3d structure (requires JavaScript / HTML 5) - Permanent link for this species. Use this link for bookmarking this species for future reference.

Kovats' RI, non-polar column, isothermal

Column type | Active phase | Temperature (C) | I | Reference | Comment |
---|---|---|---|---|---|
Capillary | Squalane | 120. | 1348. | Schomburg, 1967 | Ar; Column length: 100. m |

References

Schomburg, 1967
Schomburg, G.,
Struktur und Retentionsverhalten von Offenkettigen und Cyclischen Kohlenwasserstoffen und Deren Einfacher Substitutionsprodukte,
Anal. Chim. Acta., 1967, 38, 45-64, https://doi.org/10.1016/S0003-2670(01)80560-2
. [all data]