GA118, MeTMS
- Formula: C26H42O6Si2
- Molecular weight: 506.7791
- IUPAC Standard InChIKey: CZJKUGIUTGPWAY-IJVZLEIMSA-N
- Chemical structure:
View 3d structure (requires JavaScript / HTML 5) - Stereoisomers:
- Other names: GA118 (1α-hydroxy GA20), MeTMS; [2H2]GA118, MeTMS

Kovats' RI, non-polar column, custom temperature program

Column type | Active phase | I | Reference | Comment |
---|---|---|---|---|
Capillary | DB-1 | 2685. | Emery, Pearce, et al., 2001 | He; Column diameter: 0.25 mm; Phase thickness: 0.25 μm; Program: 60C(0.1min) => 20C/min => 200C => 5C/min => 300C |
Capillary | DB-1 | 2686. | Emery, Pearce, et al., 2001 | He; Column diameter: 0.25 mm; Phase thickness: 0.25 μm; Program: 60C(0.1min) => 20C/min => 200C => 5C/min => 300C |
Capillary | DB-1 | 2686. | Emery, Pearce, et al., 2001 | He; Column diameter: 0.25 mm; Phase thickness: 0.25 μm; Program: 60C(0.1min) => 20C/min => 200C => 5C/min => 300C |

Normal alkane RI, non-polar column, custom temperature program

Column type | Active phase | I | Reference | Comment |
---|---|---|---|---|
Capillary | DB-1 | 2690. | Nakayama, Koshioka, et al., 2001 | 30. m/0.25 mm/0.25 μm, He; Program: 60C (2min) => 2C/min => 210C => 2C/min => 280C(5min) |
Capillary | DB-1 | 2689. | Nakayama, Koshioka, et al., 2001 | 30. m/0.25 mm/0.25 μm, He; Program: 60C (2min) => 2C/min => 210C => 2C/min => 280C(5min) |

References

Emery, Pearce, et al., 2001
Emery, R.J.N.; Pearce, D.W.; Pharis, R.P.; Reid, D.M.; Chinnappa, C.C.,
Stem elongation and gibberellins in alpine and prairie ecotypes of Stellaria longipes,
Plant Growth Regul., 2001, 35, 1, 17-29, https://doi.org/10.1023/A:1013823517189
. [all data]
Nakayama, Koshioka, et al., 2001
Nakayama, M.; Koshioka, M.; Matsui, H.; Ohara, H.; Mander, L.N.; Leitch, S.K.; Twitchin, B.; Kraft-Klaunzer, P.; Pharis, R.P.; Yokota, T.,
Endogenous gibberellins in immature seeds of Prunus persica L.: identification of GA118, GA119, GA120, GA121, GA122 and GA126,
Phytochemistry, 2001, 57, 5, 749-758, https://doi.org/10.1016/S0031-9422(01)00154-6
. [all data]