trans (trans,trans)-Bicyclo[10.1.0]trideca-4,8-diene
- Formula: C13H20
- Molecular weight: 176.2979
- IUPAC Standard InChIKey: OKQPAVLKCLUCOF-KSNBDJSYSA-N
- Chemical structure:
View 3d structure (requires JavaScript / HTML 5) - Stereoisomers:
- Other names: (E,E,E)-Bicyclo[10.1.0]trideca-4,8-diene

Kovats' RI, non-polar column, isothermal

Column type | Active phase | Temperature (C) | I | Reference | Comment |
---|---|---|---|---|---|
Capillary | Squalane | 120. | 1357. | Schomburg, 1967 | Ar; Column length: 100. m |

References

Schomburg, 1967
Schomburg, G.,
Struktur und Retentionsverhalten von Offenkettigen und Cyclischen Kohlenwasserstoffen und Deren Einfacher Substitutionsprodukte,
Anal. Chim. Acta., 1967, 38, 45-64, https://doi.org/10.1016/S0003-2670(01)80560-2
. [all data]