d3-Methionine, mono-TMS

Van Den Dool and Kratz RI, non-polar column, temperature ramp

View large format table.

Column type Active phase I Reference Comment
CapillaryDB-51420.Fu, Iga, et al., 200030. m/0.25 mm/0.25 μm, He, 100. C @ 1. min, 10. K/min, 290. C @ 8. min

References

Fu, Iga, et al., 2000
Fu, X.; Iga, M.; Kimura, M.; Yamaguchi, S., Simplified screening for organic acidemia using GC/MS and dried urine filter paper: a study on neonatal mass screening, Early Hum. Dev., 2000, 58, 1, 41-55, https://doi.org/10.1016/S0378-3782(00)00053-0 . [all data]