2-Methyl-3-hydroxyvaleric acid, diTMS (1)
- Formula: C12H28O3Si2
- Molecular weight: 276.5199
- IUPAC Standard InChIKey: NYQQSMMILUJHAT-GHMZBOCLSA-N
- Chemical structure:
View 3d structure (requires JavaScript / HTML 5) - Stereoisomers:

Van Den Dool and Kratz RI, non-polar column, temperature ramp

Column type | Active phase | I | Reference | Comment |
---|---|---|---|---|
Capillary | DB-5 | 1276. | Kimura, Yamamoto, et al., 1999 | 30. m/0.25 mm/1. μm, He, 100. C @ 4. min, 4. K/min, 290. C @ 10. min |

References

Kimura, Yamamoto, et al., 1999
Kimura, M.; Yamamoto, T.; Yamaguchi, S.,
Automated metabolic profiling and interpretation of GC/MS data for organic acidemia screening: a personal computer-based system,
Tohoku J. Exp. Med., 1999, 188, 4, 317-334, https://doi.org/10.1620/tjem.188.317
. [all data]