3,5-dibutyl-2-pentyl-pyridine

Van Den Dool and Kratz RI, non-polar column, temperature ramp

Data compiled by: NIST Mass Spectrometry Data Center, William E. Wallace, director

Column type CapillaryCapillary
Active phase BPX-5BPX-5
Column length (m) 50.50.
Carrier gas  He
Substrate
Column diameter (mm) 0.320.32
Phase thickness (μm) 0.50.5
Tstart (C) 60.60.
Tend (C) 250.280.
Heat rate (K/min) 4.10.
Initial hold (min) 5.2.
Final hold (min) 20.
I 1919.1918.
ReferenceBredie, Mottram, et al., 2002Elmore and Mottram, 1997
Comment MSDC-RI MSDC-RI

References

Bredie, Mottram, et al., 2002
Bredie, W.L.P.; Mottram, D.S.; Guy, R.C.E., Effect of temperature and pH on the generation of flavor volatiles in extrusion cooking of wheat flour, J. Agric. Food Chem., 2002, 50, 5, 1118-1125, https://doi.org/10.1021/jf0111662 . [all data]

Elmore and Mottram, 1997
Elmore, J.S.; Mottram, D.S., Investigation of the reaction between ammonium sulfide, aldehydes, and α-dicarbonyls to form some lipid-Maillard interaction products found in cooked beef, J. Agric. Food Chem., 1997, 45, 9, 3595-3602, https://doi.org/10.1021/jf970065u . [all data]