Octadecenoic acid, methyl ester
- Formula: C19H34O2
- Molecular weight: 294.4721
- IUPAC Standard InChIKey: WTTJVINHCBCLGX-ZDVGBALWSA-N
- Chemical structure:
View 3d structure (requires JavaScript / HTML 5) - Species with the same structure:
- Stereoisomers:

Van Den Dool and Kratz RI, non-polar column, temperature ramp

Column type | Active phase | I | Reference | Comment |
---|---|---|---|---|
Capillary | DB-1 | 2078. | Johnson, Urso, et al., 1997 | 30. m/0.2 mm/0.25 μm, 50. C @ 2. min, 5. K/min, 300. C @ 5. min |

Normal alkane RI, non-polar column, temperature ramp

Column type | Active phase | I | Reference | Comment |
---|---|---|---|---|
Capillary | HP-1 | 2111. | Boatright and Crum, 1997 | 30. m/0.25 mm/0.1 μm, He, 50. C @ 2. min, 5. K/min, 300. C @ 3. min |

Lee's RI, non-polar column, temperature ramp

Column type | Active phase | I | Reference | Comment |
---|---|---|---|---|
Capillary | DB-1 | 357.6 | Johnson, Urso, et al., 1997 | 30. m/0.2 mm/0.25 μm, 50. C @ 2. min, 5. K/min, 300. C @ 5. min |

References

Johnson, Urso, et al., 1997
Johnson, C.I.; Urso, A.; Geleta, L.,
Broad spectrum analysis of municipal and industrial effluents discharged into the Peace, Athabasca and Slave river basins: characterization of effluent samples, 1994 - Volume 1 of 2, Northern River Basins Study Project Report No. 121, Norther River Basins Study, Edmonton, Alberta, 1997, 27. [all data]
Boatright and Crum, 1997
Boatright, W.L.; Crum, A.D.,
Nonpolar-volatile lipids from soy protein isolates and hexane-defatted flakes,
J. Amer. Oil Chem. Soc., 1997, 74, 4, 461-467, https://doi.org/10.1007/s11746-997-0107-z
. [all data]