Methyl-phosphonic acid pinacolyl ester methyl ester, diastereomer 1

Normal alkane RI, non-polar column, temperature ramp

View large format table.

Column type Active phase I Reference Comment
CapillarySE-541200.Söderström, Ketola, et al., 199525. m/0.32 mm/0.25 μm, He, 40. C @ 2. min, 10. K/min, 250. C @ 10. min

References

Söderström, Ketola, et al., 1995
Söderström, M.T.; Ketola, R.A.; Kostiainen, O., Identification of some nerve agent homologues and dialkyl methylphosphonates by gas chromatography/Fourier transform infrared spectrometry. Part II. Spectral search with the help of retention indices, Fresenius J. Anal. Chem., 1995, 352, 6, 550-556, https://doi.org/10.1007/BF00323072 . [all data]