3-ethyl furan
- Formula: C6H8O
- Molecular weight: 96.1271
- IUPAC Standard InChIKey: RPCHNECSJGMRGP-UHFFFAOYSA-N
- Chemical structure:
View 3d structure (requires JavaScript / HTML 5) - Species with the same structure:
- Other names: Furan, 3-ethyl

Kovats' RI, polar column, temperature ramp

Column type | Active phase | I | Reference | Comment |
---|---|---|---|---|
Capillary | DB-Wax | 1021. | Shimoda and Shibamoto, 1990 | He, 40. C @ 6. min, 3. K/min; Column length: 60. m; Column diameter: 0.25 mm; Tend: 190. C |

Normal alkane RI, non-polar column, temperature ramp

Column type | Active phase | I | Reference | Comment |
---|---|---|---|---|
Capillary | OV-101 | 704. | Zenkevich, 2005 | 25. m/0.20 mm/0.10 μm, N2/He, 6. K/min; Tstart: 50. C; Tend: 250. C |
Capillary | DB-1 | 701. | Barrefors, Björkqvist, et al., 1996 | 50. m/0.32 mm/1. μm, 3. K/min; Tstart: -30. C |

References

Shimoda and Shibamoto, 1990
Shimoda, M.; Shibamoto, T.,
Isolation and identification of headspace volatiles from brewed coffee with an on-column GC/MS method,
J. Agric. Food Chem., 1990, 38, 3, 802-804, https://doi.org/10.1021/jf00093a045
. [all data]
Zenkevich, 2005
Zenkevich, I.G.,
Experimentally measured retention indices., 2005. [all data]
Barrefors, Björkqvist, et al., 1996
Barrefors, G.; Björkqvist, S.; Ramnäs, O.; Petersson, G.,
Gas chromatographic separation of volatile furans from birchwood smoke,
J. Chromatogr. A, 1996, 753, 1, 151-155, https://doi.org/10.1016/S0021-9673(96)00534-1
. [all data]