2-Propyn-1-ol, dibromoacetate
- Formula: C5H4Br2O2
- Molecular weight: 255.892
- IUPAC Standard InChIKey: APSASYICDFPGGQ-UHFFFAOYSA-N
- Chemical structure:
View 3d structure (requires JavaScript / HTML 5) - Species with the same structure:

Van Den Dool and Kratz RI, non-polar column, temperature ramp

Column type | Active phase | I | Reference | Comment |
---|---|---|---|---|
Capillary | SE-30 | 1130. | Korhonen, 1984 | N2, 6. K/min; Column length: 25. m; Column diameter: 0.30 mm; Tstart: 50. C |

Van Den Dool and Kratz RI, polar column, temperature ramp

Column type | Active phase | I | Reference | Comment |
---|---|---|---|---|
Capillary | OV-351 | 1965. | Korhonen, 1984 | N2, 6. K/min; Column length: 25. m; Column diameter: 0.32 mm; Tstart: 50. C |

References

Korhonen, 1984
Korhonen, I.O.O.,
Gas-Liquid Chromatographic Analyses. XXVI. Separation of Unsaturated Alcohols and Their Acetyl and Haloacetyl Derivatives on Capillary Columns Coated with SE-30 and OV-351,
J. Chromatogr., 1984, 288, 329-346, https://doi.org/10.1016/S0021-9673(01)93710-0
. [all data]