19-methylheptatriacontane

Van Den Dool and Kratz RI, non-polar column, temperature ramp

View large format table.

Column type Active phase I Reference Comment
CapillaryDB-5MS3722.Steiner, Steidle, et al., 200530. m/0.32 mm/0.25 μm, He, 2. K/min; Tstart: 150. C; Tend: 300. C
CapillaryUltra-13733.Nelson, Adams, et al., 2003150. C @ 4. min, 4. K/min, 320. C @ 30. min; Column length: 12. m; Column diameter: 0.2 mm

Van Den Dool and Kratz RI, non-polar column, custom temperature program

View large format table.

Column type Active phase I Reference Comment
CapillaryDB-13735.Bernier, Carlson, et al., 199830. m/0.32 mm/0.25 μm; Program: 60C (2min) => 10C/min => 220C => 3C/min => 310C

Normal alkane RI, non-polar column, custom temperature program

View large format table.

Column type Active phase I Reference Comment
CapillaryDB-13735.Carlson, Geden, et al., 199930. m/0.32 mm/0.25 μm, He; Program: 60C (2min) => 10C/min => 220C => 3C/min => 310C (12 - 42 min)
CapillaryCP Sil 5 CB3730.Kenig, Sinninghe Damsté, et al., 199525. m/0.32 mm/0.2 μm, He; Program: 50C => 20C/min => 130C => 4C/min => 300C (20min)

References

Steiner, Steidle, et al., 2005
Steiner, S.; Steidle, J.L.M.; Ruther, J., Female sex pheromone in immature insect males - a case of pre-emergence chemical mimicry?, Behavioral Ecology and Sociobiology, 2005, 58, 2, 111-120, https://doi.org/10.1007/s00265-005-0930-x . [all data]

Nelson, Adams, et al., 2003
Nelson, D.R.; Adams, T.S.; Fatland, C.L., Hydrocarbons in the surface wax of eggs and adults of the Colorado potato beetle, Leptinotarsa decemlineata, Comp. Biochem. Physiol. B: Comp. Biochem., 2003, 134, 3, 447-466, https://doi.org/10.1016/S1096-4959(02)00262-2 . [all data]

Bernier, Carlson, et al., 1998
Bernier, U.R.; Carlson, D.A.; Geden, C.J., Gas chromatography/mass spectrometry analysis of the cuticular hydrocarbons from parasitic wasps of the genus Muscidifurax, J. Am. Soc. Mass Spectrom., 1998, 9, 4, 320-332, https://doi.org/10.1016/S1044-0305(97)00288-2 . [all data]

Carlson, Geden, et al., 1999
Carlson, D.A.; Geden, C.J.; Bernier, U.R., Identification of pupal exiviae of Nasania vitripennis and Muscidifurax raptorellus parasitoids using cuticular hydrocarbons, Biol. Control, 1999, 15, 2, 97-106, https://doi.org/10.1006/bcon.1999.0708 . [all data]

Kenig, Sinninghe Damsté, et al., 1995
Kenig, F.; Sinninghe Damsté, J.S.; Kock-van Dalen, A.C.; Rijpstra, W.I.C.; Huc, A.Y.; de Leeuw, J.W., Occurrence and origin of mono-, di-, and trimethylalkanes in modern and holocene cyanobacterial mats from Abu Dhabi, United Arab Emirates, Geochim. Cosmochim. Acta, 1995, 59, 14, 2999-3015, https://doi.org/10.1016/0016-7037(95)00190-5 . [all data]