4β-hydroxylupinine
- Formula: C10H19NO2
- Molecular weight: 185.2634
- IUPAC Standard InChIKey: XJGGJDSGTDKLPJ-IVZWLZJFSA-N
- Chemical structure:
View 3d structure (requires JavaScript / HTML 5) - Stereoisomers:

Normal alkane RI, non-polar column, custom temperature program

Column type | Active phase | I | Reference | Comment |
---|---|---|---|---|
Capillary | DB-1 | 1605. | Greinwald, Ross, et al., 1995 | He; Column length: 30. m; Column diameter: 0.32 mm; Program: 150C (2min) => 10C/min => 250C => 20C/min => 300C (5min) |

References

Greinwald, Ross, et al., 1995
Greinwald, R.; Ross, J.H.; Witte, L.; Czygan, F.-C.,
The alkaloid pattern of Plagiocarpus axillaris (Fabaceae: Brongniartieae),
Biochem. Syst. Ecol., 1995, 23, 6, 645-648, https://doi.org/10.1016/0305-1978(95)00059-3
. [all data]