Pentane, 3-iodo-3-methyl
- Formula: C6H13I
- Molecular weight: 212.0719
- IUPAC Standard InChIKey: CIDZNASUPYMQCG-UHFFFAOYSA-N
- Chemical structure:
View 3d structure (requires JavaScript / HTML 5) - Species with the same structure:
- Other names: 3-Iodo-3-methylpentane

Kovats' RI, non-polar column, isothermal

Column type | Active phase | Temperature (C) | I | Reference | Comment |
---|---|---|---|---|---|
Packed | Apiezon L | 75. | 1023. | Castello, 1984 | N2, Chromosorb W DMCS; Column length: 3. m |

Kovats' RI, polar column, isothermal

Column type | Active phase | Temperature (C) | I | Reference | Comment |
---|---|---|---|---|---|
Packed | Carbowax 20M | 75. | 1179. | Castello, 1984 | N2, Chromosorb W DMCS; Column length: 3. m |

Normal alkane RI, non-polar column, isothermal

Column type | Active phase | Temperature (C) | I | Reference | Comment |
---|---|---|---|---|---|
Capillary | Apiezon L | 130. | 958. | Arruda, Junkes, et al., 2008 |

References

Castello, 1984
Castello, G.,
Gas Chromatographic Identification of Alkyl Radicals Formed in Plasma Radiofrequency Discharges by Using Iodine as a Scavenger,
J. Chromatogr., 1984, 303, 61-66, https://doi.org/10.1016/S0021-9673(01)96045-5
. [all data]
Arruda, Junkes, et al., 2008
Arruda, A.C.S.; Junkes, B. da.S.; Souza, E.S.; Yunes, R.A.; Heizen, V.E.F.,
Semi-Emlirical Topological Index to Predict Properties of Halogenated Aliphatic Compounds,
J. Chemometrics, 2008, 22, 3-4, 186-194, https://doi.org/10.1002/cem.1121
. [all data]