Diazepam, M(HO-), acid hydrolyzed, acetylated
- Formula: C18H16ClNO4
- Molecular weight: 345.777
- IUPAC Standard InChIKey: TYJLUIQZXUESTG-UHFFFAOYSA-N
- Chemical structure:
View 3d structure (requires JavaScript / HTML 5) - Permanent link for this species. Use this link for bookmarking this species for future reference.

Kovats' RI, non-polar column, temperature ramp

Column type | Active phase | I | Reference | Comment |
---|---|---|---|---|
Packed | OV-101 | 2600. | Maurer, 1990 | N2, Chromosorb G HP, 100. C @ 3. min, 30. K/min, 310. C @ 5. min; Column length: 0.6 m |

References

Maurer, 1990
Maurer, H.H.,
Detection of anticonvulsants and their metabolites in urine within a general unknown analysis procedure using computerized gas chromatography-mass spectrometry,
Arch. Toxicol., 1990, 64, 7, 554-561, https://doi.org/10.1007/BF01971834
. [all data]