TOCAINIDE, AC
- Formula: C13H18N2O2
- Molecular weight: 234.2942
- IUPAC Standard InChIKey: GEHWZSUZEPBZNQ-UHFFFAOYSA-N
- Chemical structure:

Kovats' RI, non-polar column, temperature ramp

Column type | Active phase | I | Reference | Comment |
---|---|---|---|---|
Packed | OV-101 | 2040. | Maurer, 1990 | N2, Chromosorb G HP, 100. C @ 3. min, 30. K/min, 310. C @ 5. min; Column length: 0.60 m |

References

Maurer, 1990
Maurer, H.H.,
Identification of antiarrhythmic drugs and their metabolites in urine,
Arch. Toxicol., 1990, 64, 3, 218-230, https://doi.org/10.1007/BF02010728
. [all data]