PROPAFENONE-H2O, M(DESAMINO-HO-), AC
- Formula: C20H20O4
- Molecular weight: 324.3704
- IUPAC Standard InChIKey: JNJLPJKSKKKSAY-VIZOYTHASA-N
- Chemical structure:

Kovats' RI, non-polar column, temperature ramp

Column type | Active phase | I | Reference | Comment |
---|---|---|---|---|
Packed | OV-101 | 2715. | Maurer, 1990 | N2, Chromosorb G HP, 100. C @ 3. min, 30. K/min, 310. C @ 5. min; Column length: 0.60 m |

References

Maurer, 1990
Maurer, H.H.,
Identification of antiarrhythmic drugs and their metabolites in urine,
Arch. Toxicol., 1990, 64, 3, 218-230, https://doi.org/10.1007/BF02010728
. [all data]