Pentane, 1-iodo-3,3-dimethyl
- Formula: C7H15I
- Molecular weight: 226.0985
- IUPAC Standard InChIKey: FYTNBCANGRHTEA-UHFFFAOYSA-N
- Chemical structure:
View 3d structure (requires JavaScript / HTML 5) - Permanent link for this species. Use this link for bookmarking this species for future reference.

Kovats' RI, non-polar column, isothermal

Column type | Active phase | Temperature (C) | I | Reference | Comment |
---|---|---|---|---|---|
Packed | Apiezon L | 75. | 1054. | Castello, 1984 | N2, Chromosorb W DMCS; Column length: 3. m |

Kovats' RI, polar column, isothermal

Column type | Active phase | Temperature (C) | I | Reference | Comment |
---|---|---|---|---|---|
Packed | Carbowax 20M | 75. | 1146. | Castello, 1984 | N2, Chromosorb W DMCS; Column length: 3. m |

References

Castello, 1984
Castello, G.,
Gas Chromatographic Identification of Alkyl Radicals Formed in Plasma Radiofrequency Discharges by Using Iodine as a Scavenger,
J. Chromatogr., 1984, 303, 61-66, https://doi.org/10.1016/S0021-9673(01)96045-5
. [all data]