α,β-3,5-dimethylheptane
- Formula: C9H20
- Molecular weight: 128.2551
- IUPAC Standard InChIKey: DZJTZGHZAWTWGA-IUCAKERBSA-N
- Chemical structure:
View 3d structure (requires JavaScript / HTML 5) - Stereoisomers:
- Other names: 3,5-Dimethylheptane, (D)

Van Den Dool and Kratz RI, non-polar column, temperature ramp

Column type | Active phase | I | Reference | Comment |
---|---|---|---|---|
Capillary | PONA | 827.4 | Martos, Saraullo, et al., 1997 | 50. m/0.2 mm/0.5 μm, 35. C @ 0.5 min, 1. K/min, 220. C @ 8. min |
Capillary | PONA | 833.3 | Martos, Saraullo, et al., 1997 | 50. m/0.2 mm/0.5 μm, 35. C @ 0.5 min, 1. K/min, 220. C @ 8. min |
Capillary | SE-30 | 834.7 | Krupcík, Repka, et al., 1987 | 60. m/0.25 mm/1. μm, H2, 1. K/min; Tstart: 60. C |

References

Martos, Saraullo, et al., 1997
Martos, P.A.; Saraullo, A.; Pawliszyn, J.,
Estimation of air/coating distribution coefficients for solid phase microextraction using retention indexes from linear temperature-programmed capillary gas chromatography. Application to the sampling and analysis of total petroleum hydrocarbons in air,
Anal. Chem., 1997, 69, 3, 402-408, https://doi.org/10.1021/ac960633p
. [all data]
Krupcík, Repka, et al., 1987
Krupcík, J.; Repka, D.; Hevesi, T.; Garaj, J.,
Use of Kováts retention indices for characterizing solutes in complex samples separated by linear temperature-programmed capillary gas-liquid chromatography,
J. Chromatogr., 1987, 406, 117-129, https://doi.org/10.1016/S0021-9673(00)94022-6
. [all data]