bromazepam-N(Py)-oxide
- Formula: C14H10BrN3O2
- Molecular weight: 332.152
- IUPAC Standard InChIKey: UXBHJGIEDLZVCU-UHFFFAOYSA-N
- Chemical structure:
View 3d structure (requires JavaScript / HTML 5) - Permanent link for this species. Use this link for bookmarking this species for future reference.

Kovats' RI, non-polar column, isothermal

Column type | Active phase | Temperature (C) | I | Reference | Comment |
---|---|---|---|---|---|
Packed | SE-30 | 250. | 2650. | Schütz, 1982 | N2 |

References

Schütz, 1982
Schütz, H.,
Benzodiazepines, Springer-Verlag, New York, 1982, 438. [all data]