2-(2-Methoxycarbonyl-ethyl)-4-methyl-5-pentyl-furan-3-carboxylic acid methyl ester
- Formula: C16H24O5
- Molecular weight: 296.3588
- IUPAC Standard InChIKey: PVPQIQKYSSSTQU-UHFFFAOYSA-N
- Chemical structure:
View 3d structure (requires JavaScript / HTML 5) - Permanent link for this species. Use this link for bookmarking this species for future reference.

Normal alkane RI, non-polar column, temperature ramp

Column type | Active phase | I | Reference | Comment |
---|---|---|---|---|
Capillary | OV-101 | 1938. | Pinkston, Spiteller, et al., 1981 | H2, 80. C @ 7. min, 2. K/min; Column length: 30. m; Column diameter: 0.3 mm; Tend: 275. C |

References

Pinkston, Spiteller, et al., 1981
Pinkston, D.; Spiteller, G.; von Henning, H.; Matthaei, D.,
High-resolution gas chromatography-mass spectrometry of the methyl esters of organic acids from uremic hemofiltrates,
J. Chromatogr., 1981, 223, 1, 1-19, https://doi.org/10.1016/S0378-4347(00)80063-8
. [all data]