(Z)-11-Hexadecenoic acid, methyl ester

Normal alkane RI, non-polar column, temperature ramp

View large format table.

Column type Active phase I Reference Comment
CapillaryBPX-51914.Dickschat, Bode, et al., 200525. m/0.22 mm/0.25 μm, He, 50. C @ 5. min, 5. K/min; Tend: 300. C

References

Dickschat, Bode, et al., 2005
Dickschat, J.S.; Bode, H.B.; Kroppenstedt, R.M.; Müller, R.; Schulz, S., Biosynthesis of iso-fatty acids in myxobacteria, Org. Biomol. Chem., 2005, 3, 15, 2824-2831, https://doi.org/10.1039/b504889c . [all data]