2,6-Dimethyl-octa-2,4,6-triene, cis
- Formula: C10H16
- Molecular weight: 136.2340
- IUPAC Standard InChIKey: GQVMHMFBVWSSPF-LTFLHPNNSA-N
- Chemical structure:
View 3d structure (requires JavaScript / HTML 5) - Species with the same structure:
- Stereoisomers:
- Other names: Alloocimene, cis

Kovats' RI, non-polar column, isothermal

Column type | Active phase | Temperature (C) | I | Reference | Comment |
---|---|---|---|---|---|
Capillary | Apiezon L | 100. | 1130. | Morishita, Okano, et al., 1980 | Column length: 45. m; Column diameter: 0.25 mm |

Kovats' RI, polar column, isothermal

Column type | Active phase | Temperature (C) | I | Reference | Comment |
---|---|---|---|---|---|
Capillary | PEG-20M | 100. | 1370. | Morishita, Okano, et al., 1980 | Column length: 75. m; Column diameter: 0.25 mm |

Van Den Dool and Kratz RI, non-polar column, temperature ramp

Column type | Active phase | I | Reference | Comment |
---|---|---|---|---|
Capillary | DB-1 | 1131. | Combariza, Tirado, et al., 1994 | 60. m/0.25 mm/0.25 μm, He, 70. C @ 5. min, 2.5 K/min, 250. C @ 15. min |

References

Morishita, Okano, et al., 1980
Morishita, F.; Okano, T.; Kojima, T.,
Retention indices of monocyclic monoterpene hydrocarbons,
Bunseki Kagaku, 1980, 29, 1, 48-53, https://doi.org/10.2116/bunsekikagaku.29.48
. [all data]
Combariza, Tirado, et al., 1994
Combariza, M.Y.; Tirado, C.B.; Stashenko, E.; Shibamoto, T.,
Limonene concentration in lemon (Citrus volkameriana) peel oil as a function of ripeness,
J. Hi. Res. Chromatogr., 1994, 17, 9, 643-646, https://doi.org/10.1002/jhrc.1240170905
. [all data]