heptadecadiene-1,16
- Formula: C17H32
- Molecular weight: 236.4360
- IUPAC Standard InChIKey: LGYMYODKHKZIEU-UHFFFAOYSA-N
- Chemical structure:
View 3d structure (requires JavaScript / HTML 5) - Other names: 1,16-Heptadecadiene

Kovats' RI, non-polar column, isothermal

Column type | Active phase | Temperature (C) | I | Reference | Comment |
---|---|---|---|---|---|
Packed | SE-30 | 175. | 1679. | Casteignau and Villessot, 1968 | Column length: 3. m |

Kovats' RI, polar column, isothermal

Column type | Active phase | Temperature (C) | I | Reference | Comment |
---|---|---|---|---|---|
Packed | Carbowax 20M | 175. | 1799. | Casteignau and Villessot, 1968 | Column length: 3. m |

Normal alkane RI, non-polar column, temperature ramp

Column type | Active phase | I | Reference | Comment |
---|---|---|---|---|
Capillary | Petrocol DH | 1682. | Sojak, Kubinec, et al., 2006 | 150. m/0.25 mm/1.0 μm, 1. K/min; Tstart: 40. C; Tend: 300. C |

References

Casteignau and Villessot, 1968
Casteignau, G.; Villessot, D.,
Identification par chromatographie en phase gaseuse de composés difonctionnels insaturés. I. Synthèse et indices de rétention,
Bull. Soc. Chim. Fr., 1968, 9, 3893-3903. [all data]
Sojak, Kubinec, et al., 2006
Sojak, L.; Kubinec, R.; Jurdakova, H.; Hajekova, E.; Bajus, M.,
GC-MS of polyethylene and polypropylene thermal cracking produxts,
Petroleum Coal, 2006, 48, 1, 1-14. [all data]