dimethyl-3,9 undecadiene-1,10

Kovats' RI, polar column, isothermal

Data compiled by: NIST Mass Spectrometry Data Center, William E. Wallace, director

Column type Packed
Active phase Carbowax 20M
Column length (m) 3.
Carrier gas
Substrate
Column diameter (mm)
Phase thickness (μm)
Temperature (C) 175.
I 1345.
ReferenceCasteignau and Villessot, 1968
Comment MSDC-RI

References

Casteignau and Villessot, 1968
Casteignau, G.; Villessot, D., Identification par chromatographie en phase gaseuse de composés difonctionnels insaturés. I. Synthèse et indices de rétention, Bull. Soc. Chim. Fr., 1968, 9, 3893-3903. [all data]