Lepidozene

Normal alkane RI, polar column, temperature ramp

View large format table.

Column type Active phase I Reference Comment
CapillaryDB-Wax1676.Pollak and Berger, 199630. m/0.32 mm/0.5 μm, He, 40. C @ 1. min, 3. K/min, 210. C @ 25. min

References

Pollak and Berger, 1996
Pollak, F.C.; Berger, R.G., Geosmin and Related Volatiles in Bioreactor-Cultured Streptomyces citreus CBS 109.60, Appl. Environ. Microbiol., 1996, 62, 4, 1295-1299. [all data]