linalyloxide trans (II)
- Formula: C10H18O2
- Molecular weight: 170.2487
- IUPAC Standard InChIKey: BRHDDEIRQPDPMG-SCZZXKLOSA-N
- Chemical structure:
View 3d structure (requires JavaScript / HTML 5) - Species with the same structure:
- Stereoisomers:
- Linalool oxide
- 2-Furanmethanol, 5-ethenyltetrahydro-α,α,5-trimethyl-, cis-
- Linalool oxide
- Linalol oxide furanoid B
- Linalool Z-furanic oxide
- Linalool oxide 2
- Linalool oxide #1
- Linalool oxide #2
- Linalool oxide-I (furanoid)
- Linalool oxide (isomer I)
- Linalool oxide (isomer II)
- Linallol oxide isomer # 1
- Linalool oxide isomer # 2
- cis-furan Linalool oxide
- cis-Linalool oxide (furan)
- (Z)-Furan linalool oxide
- cis-Linalool oxide I
- (Z)-Linalool oxide (furanoid)
- cis-Linalool oxde, furanoid
- Other names: trans-Linalyl oxide

Van Den Dool and Kratz RI, non-polar column, temperature ramp

Column type | Active phase | I | Reference | Comment |
---|---|---|---|---|
Capillary | OV-1 | 1072. | Bicchi, Rubiolo, et al., 2003 | 25. m/0.25 mm/0.3 μm, H2, 50. C @ 1. min, 3. K/min, 200. C @ 20. min |

Normal alkane RI, non-polar column, custom temperature program

Column type | Active phase | I | Reference | Comment |
---|---|---|---|---|
Capillary | CP Sil 8 CB | 1085. | Schwob, Bessière, et al., 2002 | Program: not specified |

References

Bicchi, Rubiolo, et al., 2003
Bicchi, C.; Rubiolo, P.; Camargo, E.E.S.; Vilegas, W.; Gracioso, J.S.; Brito, A.R.M.S.,
Components of Turnera diffusa Willd. var. afrodisiaca (Ward) Urb. essential oil,
Flavour Fragr. J., 2003, 18, 1, 59-61, https://doi.org/10.1002/ffj.1155
. [all data]
Schwob, Bessière, et al., 2002
Schwob, I.; Bessière, J.-M.; Dherbomez, M.; Viano, J.,
Composition and antimicrobial activity of the essential oil of Hypericum coris,
Fitoterapia, 2002, 73, 6, 511-513, https://doi.org/10.1016/S0367-326X(02)00171-5
. [all data]