Chromene, 6-ethenyl-7-methoxy, 2,2-dimethyl

Normal alkane RI, polar column, temperature ramp

View large format table.

Column type Active phase I Reference Comment
CapillaryCarbowax 20M2354.Kasali, Winterhalter, et al., 200230. m/0.25 mm/0.325 μm, He, 4. K/min, 215. C @ 20. min; Tstart: 50. C

References

Kasali, Winterhalter, et al., 2002
Kasali, A.A.; Winterhalter, P.; Adio, A.M.; Knapp, H.; Bonnlander, B., Chromenes in Ageratum conyzoides L., Flavour Fragr. J., 2002, 17, 4, 247-250, https://doi.org/10.1002/ffj.1099 . [all data]