endo-2-Norborneol acetate
- Formula: C9H14O2
- Molecular weight: 154.2063
- IUPAC Standard InChIKey: YXNICIBZSREEPY-AMDVSUOASA-N
- Chemical structure:
View 3d structure (requires JavaScript / HTML 5) - Stereoisomers:

Normal alkane RI, non-polar column, temperature ramp

Column type | Active phase | I | Reference | Comment |
---|---|---|---|---|
Capillary | DB-5 | 1111. | Caredda, Marongiu, et al., 2002 | 30. m/0.25 mm/0.25 μm, He, 3. K/min, 280. C @ 30. min; Tstart: 60. C |

Normal alkane RI, non-polar column, custom temperature program

Column type | Active phase | I | Reference | Comment |
---|---|---|---|---|
Capillary | CP Sil 8 CB | 1125. | Judpentienë and Mockutë, 2004 | 50. m/0.32 mm/0.25 μm, He; Program: 60C(2min) => 5C/min => 160C(1min) => 10C/min => 250C (5min) |

References

Caredda, Marongiu, et al., 2002
Caredda, A.; Marongiu, B.; Porcedda, S.; Soro, C.,
Supercritical carbon dioxide extraction and characterization of Laurus nobilis essential oil,
J. Agric. Food Chem., 2002, 50, 6, 1492-1496, https://doi.org/10.1021/jf0108563
. [all data]
Judpentienë and Mockutë, 2004
Judpentienë, A.; Mockutë, D.,
Chemical composition of essential oils of Artemisia absinthium L. (wormwood) growing wild in Vilnius,
Chemija, 2004, 15, 4, 64-68. [all data]