Methyl (Z)-epi-jasmonate
- Formula: C13H20O3
- Molecular weight: 224.2961
- IUPAC Standard InChIKey: GEWDNTWNSAZUDX-KWKBKKAHSA-N
- Chemical structure:
View 3d structure (requires JavaScript / HTML 5) - Species with the same structure:
- Stereoisomers:

Normal alkane RI, non-polar column, custom temperature program

Column type | Active phase | I | Reference | Comment |
---|---|---|---|---|
Capillary | CP Sil 5 CB | 1649. | Weyerstahl, Marschall, et al., 1999 | He; Column length: 25. m; Column diameter: 0.39 mm; Program: not specified |

References

Weyerstahl, Marschall, et al., 1999
Weyerstahl, P.; Marschall, H.; Son, P.T.; Giang, P.M.,
Constituents of the flower essential oil of Aglaia odorata Lour. from Vietnam,
Flavour Fragr. J., 1999, 14, 4, 219-224, https://doi.org/10.1002/(SICI)1099-1026(199907/08)14:4<219::AID-FFJ815>3.0.CO;2-#
. [all data]