(E)-trans-α-bergamota-2,10-dien-12-ol
- Formula: C15H24O
- Molecular weight: 220.3505
- IUPAC Standard InChIKey: JGINTSAQGRHGMG-AKZWGNFOSA-N
- Chemical structure:
View 3d structure (requires JavaScript / HTML 5) - Species with the same structure:
- Stereoisomers:

Normal alkane RI, non-polar column, custom temperature program

Column type | Active phase | I | Reference | Comment |
---|---|---|---|---|
Capillary | CP Sil 5 CB | 1697. | Weyerstahl, Marschall, et al., 1999 | 25. m/0.25 mm/0.39 μm, N2; Program: not specified |

References

Weyerstahl, Marschall, et al., 1999
Weyerstahl, P.; Marschall, H.; Eckhardt. A.; Christiansen, C.,
Constituents of commercial Brazilian Iantana oil,
Flavour Fragr. J., 1999, 14, 1, 15-28, https://doi.org/10.1002/(SICI)1099-1026(199901/02)14:1<15::AID-FFJ777>3.0.CO;2-M
. [all data]