10-epi-α-Muurolol
- Formula: C15H26O
- Molecular weight: 222.3663
- IUPAC Standard InChIKey: LHYHMMRYTDARSZ-CBBWQLFWSA-N
- Chemical structure:
View 3d structure (requires JavaScript / HTML 5) - Stereoisomers:
- 1-Naphthalenol, 1,2,3,4,4a,7,8,8a-octahydro-1,6-dimethyl-4-(1-methylethyl)-, [1R-(1α,4β,4aβ,8aβ)]-
- τ-Muurolol
- 1-Naphthalenol, 1,2,3,4,4a,7,8,8a-octahydro-1,6-dimethyl-4-(1-methylethyl)-, [1R-(1α,4β,4aβ,8aβ)]-
- α-Cadinol
- τ-Cadinol
- Amorph-4-en-10-ol
- trans-Cadinol
- trans-Muurolol
- 10-epi- α-cadinol
- (Z)-α-Cadinol
- Cadin-4-en-10-β-ol
- amorph-4-en-10α-ol
- α-Cadinol, isomer 1
- α-Cadinol, isomer 2
- amorph-4-en-10β-ol
- Cadinol
- di-exo-T-Cadinol
- epi-α-Muurolol
- α-Muurolol
- epi-α-Cadinol
- 1-epi-Cadinol
- β-Cadin-4-en-10-ol
- α-epi-Cadinol
- trans-Muurolol
- Pilgerol
- 1-Muurolol (?)

Kovats' RI, non-polar column, temperature ramp

Column type | Active phase | I | Reference | Comment |
---|---|---|---|---|
Capillary | HP-5MS | 1641. | Salido, Altarejos, et al., 2002 | 30. m/0.25 mm/0.25 μm, He, 3. K/min; Tstart: 50. C; Tend: 250. C |

Van Den Dool and Kratz RI, non-polar column, temperature ramp

Column type | Active phase | I | Reference | Comment |
---|---|---|---|---|
Capillary | CP Sil 5 CB | 1632. | Weyerstahl, Marschall, et al., 1999 | He, 5. K/min; Column length: 25. m; Column diameter: 0.25 mm; Tstart: 60. C; Tend: 260. C |

References

Salido, Altarejos, et al., 2002
Salido, S.; Altarejos, J.; Nogueras, M.; Sánchez, A.; Pannecouque, C.; Witvrouw, M.; De Clercq, E.,
Chemical studies of essential oils of Juniperus oxycedrus ssp. badia,
J. Ethnopharmacol., 2002, 81, 1, 129-134, https://doi.org/10.1016/S0378-8741(02)00045-4
. [all data]
Weyerstahl, Marschall, et al., 1999
Weyerstahl, P.; Marschall, H.; Wahlburg, H.-C.; Christiansen, C.; Rustaiyan, A.; Mirdjalili, F.,
Constituents of the essential oil of Pulicaria gnaphalodes (Vent.) Boiss. from Iran,
Flavour Fragr. J., 1999, 14, 2, 121-130, https://doi.org/10.1002/(SICI)1099-1026(199903/04)14:2<121::AID-FFJ790>3.0.CO;2-K
. [all data]