2-(propylthio)ethylamine
- Formula: C5H13NS
- Molecular weight: 119.228
- IUPAC Standard InChIKey: KHHKBTRFZTUVRD-UHFFFAOYSA-N
- Chemical structure:
View 3d structure (requires JavaScript / HTML 5) - Permanent link for this species. Use this link for bookmarking this species for future reference.

Normal alkane RI, non-polar column, temperature ramp

Column type | Active phase | I | Reference | Comment |
---|---|---|---|---|
Capillary | HP-5 | 1029. | Kubec, Drhová, et al., 1999 | 30. m/0.25 mm/0.25 μm, N2, 40. C @ 3. min, 4. K/min, 240. C @ 10. min |

References

Kubec, Drhová, et al., 1999
Kubec, R.; Drhová, V.; Velísek, J.,
Volatile compounds thermally generated from S-propylcysteine and S-propylcysteine sulfoxide - aroma precursors of Allium vegetables,
J. Agric. Food Chem., 1999, 47, 3, 1132-1138, https://doi.org/10.1021/jf980974z
. [all data]