α-Phellandrene epoxide
- Formula: C10H16O
- Molecular weight: 152.2334
- IUPAC Standard InChIKey: YYOYQZIEGSUHQG-UHFFFAOYSA-N
- Chemical structure:
View 3d structure (requires JavaScript / HTML 5) - Species with the same structure:
- Stereoisomers:
- Other names: α-Phellandrene-1,2-epoxide; 2-Methyl-5-(1-methylethyl)-1,3-cyclohexadiene, monoepoxide

Van Den Dool and Kratz RI, non-polar column, temperature ramp

Column type | Active phase | I | Reference | Comment |
---|---|---|---|---|
Capillary | Optima 5 | 1198. | Vérité, Nacer, et al., 2004 | 25. m/0.25 mm/0.25 μm, He, 3. K/min, 280. C @ 20. min; Tstart: 60. C |
Capillary | HP-5 | 1187. | Karioti, Skaltsa, et al., 2003 | 30. m/0.25 mm/0.25 μm, He, 60. C @ 5. min, 4. K/min; Tend: 280. C |
Capillary | HP-5MS | 1211. | Lalel, Singh, et al., 2003 | 60. m/0.25 mm/0.25 μm, He, 40. C @ 1. min, 3. K/min, 310. C @ 20. min |

Van Den Dool and Kratz RI, non-polar column, custom temperature program

Column type | Active phase | I | Reference | Comment |
---|---|---|---|---|
Capillary | HP-5MS | 1193. | Pérez, Navarro, et al., 2007 | 30. m/0.25 mm/0.25 μm, He; Program: 50C(4min) => 10C/min => 200C(0.5min) => 20C/min => 260C(5min) |
Capillary | BPX-5 | 1229. | Cardeal, da Silva, et al., 2006 | 30. m/0.25 mm/0.25 μm; Program: 35C(5min) => 3C/min => 210C => 40C/min => 240C (4min) |

Normal alkane RI, non-polar column, temperature ramp

Column type | Active phase | I | Reference | Comment |
---|---|---|---|---|
Capillary | DB-5 | 1192. | Georgiou, Koutsaviti, et al., 2010 | 30. m/0.32 mm/0.25 μm, Helium, 3. K/min; Tstart: 60. C; Tend: 280. C |
Capillary | HP-1 | 1179. | Fernandez, Pintaric, et al., 2006 | 50. m/0.2 mm/0.33 μm, He, 2. K/min, 250. C @ 60. min; Tstart: 60. C |
Capillary | SE-52 | 1242. | Ozcan, Chalchat, et al., 2006 | Helium, 3. K/min; Column length: 50. m; Column diameter: 0.25 mm; Tstart: 50. C; Tend: 240. C |
Capillary | SE-30 | 1181. | Ali N.A.M. and Jantan, 1999 | He, 3. K/min; Column length: 25. m; Column diameter: 0.2 mm; Tstart: 60. C; Tend: 230. C |
Capillary | SE-30 | 1181. | Mohd and Jantan, 1999 | He, 60. C @ 10. min, 3. K/min; Column length: 25. m; Column diameter: 0.2 mm; Tend: 230. C |

Normal alkane RI, non-polar column, custom temperature program

Column type | Active phase | I | Reference | Comment |
---|---|---|---|---|
Capillary | HP-5MS | 1202. | Cole, Haber, et al., 2007 | 30. m/0.25 mm/0.25 μm, He; Program: 40C(10min) => 3C/min => 200C => 2C/min => 220C |
Capillary | DB-5 | 1202. | Hamm, Bleton, et al., 2005 | 30. m/0.25 mm/0.25 μm, He; Program: 40C(1min) => 9C/min => 130C => 2C/min => 230C |

References

Vérité, Nacer, et al., 2004
Vérité, P.; Nacer, A.; Kabouche, Z.; Seguin, E.,
Composition of seeds and stems essential oils of Pituranthos scoparius (Coss. Dur.) Schinz,
Flavour Fragr. J., 2004, 19, 6, 562-564, https://doi.org/10.1002/ffj.1353
. [all data]
Karioti, Skaltsa, et al., 2003
Karioti, A.; Skaltsa, H.; Demetzos, C.; Perdetzoglou, D.; Economakis, C.D.; Salem, A.B.,
Effect of nitrogen concentration of the nutrient solution on the volatile constituents of leaves of Salvia fruticosa Mill. in solution culture,
J. Agric. Food Chem., 2003, 51, 22, 6505-6508, https://doi.org/10.1021/jf030308k
. [all data]
Lalel, Singh, et al., 2003
Lalel, H.J.D.; Singh, Z.; Chye Tan, S.,
Glycosidically-bound aroma volatile compounds in the skin and pulp of 'Kensington Pride' mango fruit at different stages of maturity,
Postharvest Biol. Technol., 2003, 29, 2, 205-218, https://doi.org/10.1016/S0925-5214(02)00250-8
. [all data]
Pérez, Navarro, et al., 2007
Pérez, R.A.; Navarro, T.; de Lorenzo, C.,
HS-SPME analysis of the volatile compounds from spices as a source of flavour in 'Campo Real' table olive preparations,
Flavour Fragr. J., 2007, 22, 4, 265-273, https://doi.org/10.1002/ffj.1791
. [all data]
Cardeal, da Silva, et al., 2006
Cardeal, Z.L.; da Silva, M.D.R.G.; Marriott, P.J.,
Comprehensive two-dimensional gas chromatography/mass spectrometric analysis of pepper volatiles,
Rapid Commun. Mass Spectrom., 2006, 20, 19, 2823-2836, https://doi.org/10.1002/rcm.2665
. [all data]
Georgiou, Koutsaviti, et al., 2010
Georgiou, C.; Koutsaviti, A.; Bazos, I.; Tzakou, O.,
Chemical composition of Echinophora tenuifolia subsp. sibthorpiana essential oil from Greece,
Rec. Nat. Prod., 2010, 4, 3, 167-170. [all data]
Fernandez, Pintaric, et al., 2006
Fernandez, X.; Pintaric, C.; Lizzani-Cuvelier, L.; Loiseau, A.-M.; Morello, A.; Pellerin, P.,
Chemical composition of absolute and supercritical carbon dioxide extract of Aframomum melegueta,
Flavour Fragr. J., 2006, 21, 1, 162-165, https://doi.org/10.1002/ffj.1554
. [all data]
Ozcan, Chalchat, et al., 2006
Ozcan, M.M.; Chalchat, J.-C.; Arslan, D.; Ates, A.; Unver, A.,
Comparative Essential Oil Composition and Antifungal Effect of Bitter Fennel (Foeniculum vulgare ssp. piperitum) Fruit Oils Obtained During Different Vegetation,
J. Medicinal Food, 2006, 9, 4, 552-561, https://doi.org/10.1089/jmf.2006.9.552
. [all data]
Ali N.A.M. and Jantan, 1999
Ali N.A.M.; Jantan, I.,
Essential oil of cinnamomum tahijanum kost. from sarawak,
ASEAN Review of BiodiversityEnvironment Conservation, 1999, November-December, 1-4. [all data]
Mohd and Jantan, 1999
Mohd, N.A.; Jantan, I.,
Essential oil of cinnamomum tahijanum Kost. from Sarawak, 1999, retrieved from http://www.arbec.com.my/pdf/art5novdec99.pdf. [all data]
Cole, Haber, et al., 2007
Cole, R.A.; Haber, W.A.; Setzer, W.N.,
Chemical composition of essential oils of seven species of Eugenia from Monteverde, Costa Rica,
Biochem. Syst. Ecol., 2007, 35, 12, 877-886, https://doi.org/10.1016/j.bse.2007.06.013
. [all data]
Hamm, Bleton, et al., 2005
Hamm, S.; Bleton, J.; Connan, J.; Tchapla, A.,
A chemical investigation by headspace SPME and GC-MS of volatile and semi-volatile terpenes in various olibanum samples,
Phytochemistry, 2005, 66, 12, 1499-1514, https://doi.org/10.1016/j.phytochem.2005.04.025
. [all data]