10-epi-β-Acorenol
- Formula: C15H26O
- Molecular weight: 222.3663
- IUPAC Standard InChIKey: XDVDHFJMCJWDPI-UMVBOHGHSA-N
- Chemical structure:
View 3d structure (requires JavaScript / HTML 5) - Stereoisomers:

Normal alkane RI, non-polar column, custom temperature program

Column type | Active phase | I | Reference | Comment |
---|---|---|---|---|
Capillary | CP Sil 5 CB | 1645. | Weyerstahl, Marschall, et al., 1998 | N2; Column length: 25. m; Phase thickness: 0.39 μm; Program: not specified |

Normal alkane RI, polar column, custom temperature program

Column type | Active phase | I | Reference | Comment |
---|---|---|---|---|
Capillary | DB-Wax | 2214. | Weyerstahl, Marschall, et al., 1998 | N2; Column length: 60. m; Phase thickness: 0.25 μm; Program: not specified |

References

Weyerstahl, Marschall, et al., 1998
Weyerstahl, P.; Marschall, H.; Thefeld, K.; Subba, G.C.,
Constituents of the essential oil from the rhizomes of Hedychium gardnerianum Roscoe,
Flavour Fragr. J., 1998, 13, 6, 377-388, https://doi.org/10.1002/(SICI)1099-1026(199811/12)13:6<377::AID-FFJ755>3.0.CO;2-F
. [all data]