1,2-dithian-4-one

Van Den Dool and Kratz RI, non-polar column, temperature ramp

View large format table.

Column type Active phase I Reference Comment
CapillaryDB-51194.Methven L., Tsoukka M., et al., 200760. m/0.32 mm/1. μm, 40. C @ 2. min, 4. K/min, 260. C @ 10. min
CapillaryBPX-51215.Bredie, Mottram, et al., 200250. m/0.32 mm/0.5 μm, 60. C @ 5. min, 4. K/min, 250. C @ 20. min

Van Den Dool and Kratz RI, non-polar column, custom temperature program

View large format table.

Column type Active phase I Reference Comment
CapillaryCP-Sil 8CB-MS1191.Elmore, Mottram, et al., 200060. m/0.25 mm/0.25 μm, He; Program: 0C(5min) => 40C/min => 40C (2min) => 4C/min => 280C
CapillaryDB-51209.Parker, Hassell, et al., 200050. m/0.32 mm/0.5 μm, He; Program: oC(5min) => 60C/min => 60C (5min) => 4C/min => 250C
CapillaryBPX-51208.Bredie, Mottram, et al., 199850. m/0.32 mm/0.5 μm, He; Program: OC (5min) => 60C/min => 60C(5min) => 4C/min => 250C

Van Den Dool and Kratz RI, polar column, temperature ramp

View large format table.

Column type Active phase I Reference Comment
CapillaryCP-Wax 52CB1893.Mahadevan and Farmer, 200660. C @ 5. min, 4. K/min, 220. C @ 30. min; Column length: 50. m; Column diameter: 0.32 mm

References

Methven L., Tsoukka M., et al., 2007
Methven L.; Tsoukka M.; Oruna-Concha M.J.; Parker J.K.; Mottram D.S., Influence of sulfur amino acids on the volatile and nonvolatile components of cooked salmon (Salmo salar), J. Agric. Food Chem., 2007, 55, 4, 1427-1436, https://doi.org/10.1021/jf0625611 . [all data]

Bredie, Mottram, et al., 2002
Bredie, W.L.P.; Mottram, D.S.; Guy, R.C.E., Effect of temperature and pH on the generation of flavor volatiles in extrusion cooking of wheat flour, J. Agric. Food Chem., 2002, 50, 5, 1118-1125, https://doi.org/10.1021/jf0111662 . [all data]

Elmore, Mottram, et al., 2000
Elmore, J.S.; Mottram, D.S.; Enser, M.; Wood, J.D., The effects of diet and breed on the volatile compounds of cooked lamb, Meat Sci., 2000, 55, 2, 149-159, https://doi.org/10.1016/S0309-1740(99)00137-0 . [all data]

Parker, Hassell, et al., 2000
Parker, J.K.; Hassell, G.M.E.; Mottram, D.S.; Guy, R.C.E., Sensory and instrumental analyses of volatiles generated during the extrusion cooking of oat flours, J. Agric. Food Chem., 2000, 48, 8, 3497-3506, https://doi.org/10.1021/jf991302r . [all data]

Bredie, Mottram, et al., 1998
Bredie, W.L.P.; Mottram, D.S.; Guy, R.C.E., Aroma volatiles generated during extrusion cooking of maize flour, J. Agric. Food Chem., 1998, 46, 4, 1479-1487, https://doi.org/10.1021/jf9708857 . [all data]

Mahadevan and Farmer, 2006
Mahadevan, K.; Farmer, L., Key Odor Impact Compounds in Three Yeast Extract Pastes, J. Agric. Food Chem., 2006, 54, 19, 7242-7250, https://doi.org/10.1021/jf061102x . [all data]