Linalol oxide pyranoid A
- Formula: C10H18O2
- Molecular weight: 170.2487
- IUPAC Standard InChIKey: BCTBAGTXFYWYMW-LHIURRSHSA-N
- Chemical structure:
- (3R,6R)-2,2,6-Trimethyl-6-vinyltetrahydro-2H-pyran-3-ol
- 2H-Pyran-3-ol, 6-ethenyltetrahydro-2,2,6-trimethyl-
- (3R,6S)-2,2,6-Trimethyl-6-vinyltetrahydro-2H-pyran-3-ol
- Linalool oxide II (pyran)
- Linalool oxide (pyranoid) trans
- cis-pyran Linalool oxide
- trans-pyran Linalool oxide
- cis-Linalool oxide (pyranoid)
- trans-Linalool oxide (pyranoid)
- (E)-Pyran linalool oxide
- (Z)-Pyran linalool oxide
- Other names: Linalool oxide (pyran) I

Normal alkane RI, non-polar column, custom temperature program

Column type | Active phase | I | Reference | Comment |
---|---|---|---|---|
Capillary | CP Sil 5 CB | 1152. | Weyerstahl, Marschall, et al., 1997 | N2; Column length: 30. m; Column diameter: 0.25 mm; Program: not specified |

Normal alkane RI, polar column, temperature ramp

Column type | Active phase | I | Reference | Comment |
---|---|---|---|---|
Capillary | Carbowax 20M | 1740. | Vernin, Lageot, et al., 2001 | 50. m/0.22 mm/0.25 μm, He, 2. K/min; Tstart: 60. C; Tend: 220. C |

References

Weyerstahl, Marschall, et al., 1997
Weyerstahl, P.; Marschall, H.; Seelmann, I.; Rustaiyan, A.,
Constituents of the essential oil of Achillea eriophora DC,
Flavour Fragr. J., 1997, 12, 2, 71-78, https://doi.org/10.1002/(SICI)1099-1026(199703)12:2<71::AID-FFJ620>3.0.CO;2-E
. [all data]
Vernin, Lageot, et al., 2001
Vernin, G.; Lageot, C.; Gaydou, E.M.; Parkanyi, C.,
Analysis of the essential oil of Lippia graveolens HBK from El Salvador,
Flavour Fragr. J., 2001, 16, 3, 219-226, https://doi.org/10.1002/ffj.984
. [all data]