Linalol oxide furanoid B
- Formula: C10H18O2
- Molecular weight: 170.2487
- IUPAC Standard InChIKey: BRHDDEIRQPDPMG-HTLJXXAVSA-N
- Chemical structure:
View 3d structure (requires JavaScript / HTML 5) - Species with the same structure:
- Stereoisomers:
- Linalool oxide
- trans-Linalool oxide (furanoid)
- 2-Furanmethanol, 5-ethenyltetrahydro-α,α,5-trimethyl-, cis-
- Linalool oxide
- linalyloxide trans (II)
- Linalool Z-furanic oxide
- trans-Linalol oxide (furan isomer)
- Linalool oxide 2
- Linalool oxide #1
- Linalool oxide #2
- trans-Linalool oxide (furanoid)
- Linalool oxide (isomer I)
- Linalool oxide (isomer II)
- Linallol oxide isomer # 1
- Linalool oxide isomer # 2
- cis-furan Linalool oxide
- trans-furan Linalool oxide
- cis-Linalool oxide (furan)
- trans-α,α,5-Trimethyl-5-ethenyltetrahydro-2-furanmethanol
- (E)-Furan linalool oxide
- (Z)-Furan linalool oxide
- cis-Linalool oxide I
- trans-Linalool oxide I
- (Z)-Linalool oxide (furanoid)
- cis-Linalool oxde, furanoid
- trans-Linanool oxide
- Other names: Linalool oxide-II (furanoid); Linalool trans-furanoid

Normal alkane RI, non-polar column, custom temperature program

Column type | Active phase | I | Reference | Comment |
---|---|---|---|---|
Capillary | CP Sil 5 CB | 1077. | Weyerstahl, Marschall, et al., 1997 | N2; Column length: 30. m; Column diameter: 0.25 mm; Program: not specified |

Normal alkane RI, polar column, temperature ramp

Column type | Active phase | I | Reference | Comment |
---|---|---|---|---|
Capillary | BP-20 | 1477. | Rawat, Gulati, et al., 2007 | 30. m/0.25 mm/0.25 μm, He, 70. C @ 4. min, 4. K/min, 220. C @ 5. min |
Capillary | DB-Wax | 1467. | Lee, Umano, et al., 2005 | 30. m/0.25 mm/0.25 μm, He, 3. K/min, 180. C @ 40. min; Tstart: 50. C |

References

Weyerstahl, Marschall, et al., 1997
Weyerstahl, P.; Marschall, H.; Seelmann, I.; Rustaiyan, A.,
Constituents of the essential oil of Achillea eriophora DC,
Flavour Fragr. J., 1997, 12, 2, 71-78, https://doi.org/10.1002/(SICI)1099-1026(199703)12:2<71::AID-FFJ620>3.0.CO;2-E
. [all data]
Rawat, Gulati, et al., 2007
Rawat, R.; Gulati, A.; Babu, G.D.K.; Acharya, R.; Kaul, V.K.; Singh, B.,
Characterization of volatile components of Kangra orthodox black tea by gas chromatography-mass spectrometry,
Food Chem., 2007, 105, 1, 229-235, https://doi.org/10.1016/j.foodchem.2007.03.071
. [all data]
Lee, Umano, et al., 2005
Lee, S.-J.; Umano, K.; Shibamoto, T.; Lee, K.-G.,
Identification of volatile components in basil (Ocimum basilicum L.) and thyme leaves (Thymus vulgaris L.) and their antioxidant properties,
Food Chem., 2005, 91, 1, 131-137, https://doi.org/10.1016/j.foodchem.2004.05.056
. [all data]