Silphiperfol-5-en-3-ol D

Normal alkane RI, non-polar column, temperature ramp

View large format table.

Column type Active phase I Reference Comment
CapillaryDB-51525.Bos, Stojanova, et al., 200530. m/0.249 mm/0.25 μm, He, 3. K/min; Tstart: 60. C; Tend: 290. C

Normal alkane RI, non-polar column, custom temperature program

View large format table.

Column type Active phase I Reference Comment
CapillaryCP Sil 5 CB1540.Weyerstahl, Marschall, et al., 1997He; Column length: 25. m; Program: not specified

References

Bos, Stojanova, et al., 2005
Bos, R.; Stojanova, A.; Woerdenbag, H.J.; Koulman, A.; Quax, W.J., Volatile components of the aerial parts of Artemisia pontica L. grown in Bulgaria, Flavour Fragr. J., 2005, 20, 2, 145-148, https://doi.org/10.1002/ffj.1399 . [all data]

Weyerstahl, Marschall, et al., 1997
Weyerstahl, P.; Marschall, H.; Schröder, M.; Wahlburg, H.-C.; Kaul, V.K., The sesquiterpene fraction of the essential oil of Artemisia laciniata Willd., Flavour Fragr. J., 1997, 12, 5, 315-325, https://doi.org/10.1002/(SICI)1099-1026(199709/10)12:5<315::AID-FFJ662>3.0.CO;2-Q . [all data]