6,7-dimethyl-2,3,6,7-tetrahydro-cyclopent[b]azepin-8(1H)-one

Normal alkane RI, non-polar column, temperature ramp

View large format table.

Column type Active phase I Reference Comment
CapillaryDB-11725.Chen, Lu, et al., 1997He, 4. K/min; Column length: 60. m; Column diameter: 0.32 mm; Tstart: 50. C; Tend: 280. C

References

Chen, Lu, et al., 1997
Chen, C.-W.; Lu, G.; Ho, C.-T., Generation of proline-specific Maillard compounds by the reaction of 2-deoxyglucose with proline, J. Agric. Food Chem., 1997, 45, 8, 2996-2999, https://doi.org/10.1021/jf970197n . [all data]