2-Butanone, dimethylhydrazone
- Formula: C6H14N2
- Molecular weight: 114.1888
- IUPAC Standard InChIKey: WGFNKFZVRKEEAP-UHFFFAOYSA-N
- Chemical structure:
View 3d structure (requires JavaScript / HTML 5) - Permanent link for this species. Use this link for bookmarking this species for future reference.

Kovats' RI, non-polar column, isothermal

Column type | Active phase | Temperature (C) | I | Reference | Comment |
---|---|---|---|---|---|
Capillary | Methyl Silicone | 60. | 775. | Görgényi, Király, et al., 1997 | 50. m/0.32 mm/0.52 μm, N2 |
Capillary | HP-1 | 60. | 775. | Király, Körtvélyesi, et al., 1996 | 50. m/0.32 mm/0.52 μm, N2 |
Capillary | HP-5 | 60. | 793.1 | Király, Körtvélyesi, et al., 1996 | 50. m/0.32 mm/0.52 μm, N2 |

Normal alkane RI, non-polar column, temperature ramp

Column type | Active phase | I | Reference | Comment |
---|---|---|---|---|
Capillary | OV-101 | 774. | Zenkevich, 2005 | 25. m/0.20 mm/0.10 μm, N2/He, 6. K/min; Tstart: 50. C; Tend: 250. C |

References

Görgényi, Király, et al., 1997
Görgényi, M.; Király, Z.; Körtvélyesi, T.; van Langenhove, H.; Seres, L.,
Szerkezet és retenció kapcsolata a hidrazonok gázkromatográfiájában,
Magy. Kem. Foly., 1997, 103, 12, 576-581. [all data]
Király, Körtvélyesi, et al., 1996
Király, Z.; Körtvélyesi, T.; Seres, L.; Görgényi, M.,
Structure-retention relationships in the gas chromatography of N,N-dialkylhydrazones,
Chromatographia, 1996, 42, 11/12, 653-659, https://doi.org/10.1007/BF02267697
. [all data]
Zenkevich, 2005
Zenkevich, I.G.,
Experimentally measured retention indices., 2005. [all data]