2-[(1-methyl-2-oxopropy1)-dithio]-3-pentanone

Van Den Dool and Kratz RI, non-polar column, temperature ramp

Data compiled by: NIST Mass Spectrometry Data Center, William E. Wallace, director

Column type CapillaryCapillary
Active phase DB-5DB-5
Column length (m) 30.30.
Carrier gas HeHe
Substrate
Column diameter (mm) 0.320.32
Phase thickness (μm) 1.1.
Tstart (C) 60.60.
Tend (C) 250.250.
Heat rate (K/min) 4.4.
Initial hold (min) 5.5.
Final hold (min)
I 1562.1567.
ReferenceMottram, Madruga, et al., 1995Mottram, Madruga, et al., 1995
Comment MSDC-RI MSDC-RI

References

Mottram, Madruga, et al., 1995
Mottram, D.S.; Madruga, M.S.; Whitfield, F.B., Some novel meatlike aroma compounds from the reactions of alkanediones with hydrogen sulfide and fuanthiols, J. Agric. Food Chem., 1995, 43, 1, 189-193, https://doi.org/10.1021/jf00049a035 . [all data]