6,7-Dihydro-5H-cyclopentapyrazine
- Formula: C7H8N2
- Molecular weight: 120.1518
- IUPAC Standard InChIKey: WCTDRGQIEULRBE-UHFFFAOYSA-N
- Chemical structure:
View 3d structure (requires JavaScript / HTML 5) - Species with the same structure:
- Other names: 6,7-Dihydro-5H-cyclopenta[b]pyrazine; 5,7-dihydro-5H-cyclopentapyrazine

Van Den Dool and Kratz RI, non-polar column, temperature ramp

Column type | Active phase | I | Reference | Comment |
---|---|---|---|---|
Capillary | DB-1 | 1084. | Zhang and Ho, 1991 | 60. m/0.25 mm/0.25 μm, He, 2. K/min, 220. C @ 10. min; Tstart: 40. C |

Normal alkane RI, non-polar column, temperature ramp

Column type | Active phase | I | Reference | Comment |
---|---|---|---|---|
Capillary | HP-5 | 1104. | Boylston and Viniyard, 1998 | 50. m/0.32 mm/0.52 μm, 35. C @ 15. min, 2. K/min, 250. C @ 45. min |

Normal alkane RI, polar column, temperature ramp

Column type | Active phase | I | Reference | Comment |
---|---|---|---|---|
Capillary | Carbowax 20M | 1619. | Liardon and Ledermann, 1980 | H2, 2. K/min; Column length: 39. m; Column diameter: 0.30 mm; Tstart: 60. C; Tend: 220. C |

Normal alkane RI, polar column, custom temperature program

Column type | Active phase | I | Reference | Comment |
---|---|---|---|---|
Capillary | SOLGel-Wax | 1629. | Shu and Shen, 2008 | 30. m/0.53 mm/0.50 μm, Helium; Program: 40 0C 7 0C/min -> 180 0C 10 0C/min -> 240 0C (10 min) |
Capillary | SOLGel-Wax | 1635. | Shu and Shen, 2008 | 30. m/0.53 mm/0.50 μm, Helium; Program: not specified |

References

Zhang and Ho, 1991
Zhang, Y.; Ho, C.-T.,
Comparison of the volatile compounds formed from the thermal reaction of glucose with cysteine and glutathione,
J. Agric. Food Chem., 1991, 39, 4, 760-763, https://doi.org/10.1021/jf00004a029
. [all data]
Boylston and Viniyard, 1998
Boylston, T.D.; Viniyard, B.T.,
Isolation of volatile flavor compounds from peanut butter using purge-and-trap technique
in Instrumental Methods in Food and Beverage Analysis, D. Wetzel and G. Charalambous, ed(s)., 1998, 225-243. [all data]
Liardon and Ledermann, 1980
Liardon, R.; Ledermann, S.,
volatile components of fermented soya hydrolysate. II. Composition of basic fraction,
Z. Lebensm. Unters. Forsch., 1980, 170, 3, 208-213, https://doi.org/10.1007/BF01042542
. [all data]
Shu and Shen, 2008
Shu, N.; Shen, H.,
Aroma-impact compounds in Lysimachia foenum-graecum extracts,
Flavour Fragr. J., 2008, 24, 1, 1-6, https://doi.org/10.1002/ffj.1908
. [all data]