5,10-Pristadiene
- Formula: C19H36
- Molecular weight: 264.4891
- IUPAC Standard InChIKey: GKPUAVKOKGFJRL-KLCVKJMQSA-N
- Chemical structure:
View 3d structure (requires JavaScript / HTML 5) - Permanent link for this species. Use this link for bookmarking this species for future reference.

Normal alkane RI, non-polar column, custom temperature program

Column type | Active phase | I | Reference | Comment |
---|---|---|---|---|
Capillary | Apiezon L | 1710. | Shlyakhov, 1984 | Program: not specified |

References

Shlyakhov, 1984
Shlyakhov, A.F.,
Gas chromatography in organic geochemistry, Nedra, Moscow, 1984, 221. [all data]