1,2,3,10a-Tetrahydrophenanthrene
- Formula: C14H14
- Molecular weight: 182.2610
- IUPAC Standard InChIKey: HJBQLPMMTTXLSH-UHFFFAOYSA-N
- Chemical structure:
View 3d structure (requires JavaScript / HTML 5) - Permanent link for this species. Use this link for bookmarking this species for future reference.

Lee's RI, non-polar column, custom temperature program

Column type | Active phase | I | Reference | Comment |
---|---|---|---|---|
Capillary | SE-52 | 316.17 | Shlyakhov, 1984 | Program: not specified |

References

Shlyakhov, 1984
Shlyakhov, A.F.,
Gas chromatography in organic geochemistry, Nedra, Moscow, 1984, 221. [all data]