Nonane, 2,8-dimethyl
- Formula: C11H24
- Molecular weight: 156.3083
- IUPAC Standard InChIKey: FZFRYQHIQUEAAV-UHFFFAOYSA-N
- Chemical structure:
View 3d structure (requires JavaScript / HTML 5) - Species with the same structure:

Normal alkane RI, non-polar column, custom temperature program

Column type | Active phase | I | Reference | Comment |
---|---|---|---|---|
Capillary | Squalane | 1028. | Petrov, 1984 | Program: not specified |

References

Petrov, 1984
Petrov, A.A.,
Hydrocarbons of petroleum, Nauka (publishing house), Moscow, 1984, 263. [all data]