erythro-2,3-dichloropentane

Kovats' RI, non-polar column, isothermal

View large format table.

Column type Active phase Temperature (C) I Reference Comment
CapillaryApiezon L90.877.Morishita, Terashima, et al., 1983He; Column length: 45. m; Column diameter: 0.25 mm
PackedApiezon100.885.Bayer, Goodley, et al., 1973Column length: 2. m

Kovats' RI, polar column, isothermal

View large format table.

Column type Active phase Temperature (C) I Reference Comment
CapillaryPEG-20M90.1150.Morishita, Terashima, et al., 1983He; Column length: 75. m; Column diameter: 0.25 mm

References

Morishita, Terashima, et al., 1983
Morishita, F.; Terashima, Y.; Ichise, M.; Kojima, T., Prediction of retention indices from molecular structures of chlorinated alkanes, J. Chromatogr. Sci., 1983, 21, 5, 209-213, https://doi.org/10.1093/chromsci/21.5.209 . [all data]

Bayer, Goodley, et al., 1973
Bayer, F.L.; Goodley, P.C.; Gordon, M., Rapid gas chromatographic separation of diastereomeric dihalo-butanes, pentanes, and hexanes, J. Chromatogr. Sci., 1973, 11, 8, 443-446, https://doi.org/10.1093/chromsci/11.8.443 . [all data]